[Builds] Build failed in Jenkins: Fluid Infusion #34

Jenkins builds notifications builds at lists.idrc.ocad.ca
Thu Jun 19 14:42:21 EDT 2014


See <http://ci.fluidproject.org/job/fluid-infusion/34/changes>

Changes:

[Justin Obara] FLUID-5449: Updating the version # to 2.0-SNAPSHOT

[Justin Obara] FLUID-5449: opportunistically removing a typo

[Justin Obara] FLUID-5449: Changed another 1.5 to 2.0

------------------------------------------
Started by GitHub push by cindyli
Building in workspace <http://ci.fluidproject.org/job/fluid-infusion/ws/>
Wiping out workspace first.
Cloning the remote Git repository
Cloning repository https://github.com/fluid-project/infusion.git
Fetching upstream changes from https://github.com/fluid-project/infusion.git
Fetching upstream changes from https://github.com/fluid-project/infusion.git
Checking out Revision 7be53d11b3b7d67ba8eb1ca827801ecf8cca974b (origin/master)
[fluid-infusion] $ /bin/sh -ex /tmp/hudson7482969075607666001.sh
+ npm install
npm ERR! install Couldn't read dependencies
npm ERR! Error: Invalid version: "2.0-SNAPSHOT"
npm ERR!     at Object.module.exports.fixVersionField (/usr/lib/node_modules/normalize-package-data/lib/fixer.js:175:13)
npm ERR!     at /usr/lib/node_modules/normalize-package-data/lib/normalize.js:29:38
npm ERR!     at Array.forEach (native)
npm ERR!     at normalize (/usr/lib/node_modules/normalize-package-data/lib/normalize.js:28:15)
npm ERR!     at final (/usr/lib/node_modules/read-package-json/read-json.js:310:33)
npm ERR!     at then (/usr/lib/node_modules/read-package-json/read-json.js:124:33)
npm ERR!     at /usr/lib/node_modules/read-package-json/read-json.js:234:40
npm ERR!     at fs.js:266:14
npm ERR!     at /usr/lib/node_modules/graceful-fs/graceful-fs.js:103:5
npm ERR!     at Object.oncomplete (fs.js:107:15)
npm ERR! If you need help, you may report this log at:
npm ERR!     <http://github.com/isaacs/npm/issues>
npm ERR! or email it to:
npm ERR!     <npm- at googlegroups.com>

npm ERR! System Linux 2.6.32-431.11.2.el6.x86_64
npm ERR! command "node" "/usr/bin/npm" "install"
npm ERR! cwd <http://ci.fluidproject.org/job/fluid-infusion/ws/>
npm ERR! node -v v0.10.26
npm ERR! npm -v 1.3.6
npm ERR! 
npm ERR! Additional logging details can be found in:
npm ERR!     <http://ci.fluidproject.org/job/fluid-infusion/ws/npm-debug.log>
npm ERR! not ok code 0
Build step 'Execute shell' marked build as failure


More information about the Builds mailing list